Reaction Details
TargetVascular endothelial growth factor receptor 2
LigandBDBM50181307
Substrate/Competitorn/a
Meas. Tech.ChEMBL_347372 (CHEMBL865652)
IC50 33±n/a nM
Citation Frazier, KJazan, EMcBride, CMPecchi, SRenhowe, PAShafer, CMTaylor, CBussiere, DHe, MMJansen, JMLapointe, GMa, SVora, JWiesmann, M Design and structure-activity relationship of heterocyclic analogs of 4-amino-3-benzimidazol-2-ylhydroquinolin-2-ones as inhibitors of receptor tyrosine kinases. Bioorg Med Chem Lett16:2247-51 (2006) 
 
Vascular endothelial growth factor receptor 2
Name:Vascular endothelial growth factor receptor 2
Type:PROTEIN
Mol. Mass.:152506.58
Organism:Mus musculus
Description:ChEMBL_1469997
Residue:1367
BDBM50181307
NameBDBM50181307
Synonyms:4-amino-3-(6-(4-methylpiperazin-1-yl)-1H-benzo[d]imidazol-2-yl)-1,5-naphthyridin-2(1H)-one | CHEMBL205405
TypeSmall organic molecule
Emp. Form.C20H21N7O
Mol. Mass.375.427
SMILESCN1CCN(CC1)c1ccc2nc([nH]c2c1)-c1c(N)c2ncccc2[nH]c1=O