Reaction Details
TargetFructose-1,6-bisphosphatase 1
LigandBDBM50181348
Substrate/Competitorn/a
Meas. Tech.ChEMBL_345422 (CHEMBL861116)
IC50>50000±n/a nM
Citation Lai, CGum, RJDaly, MFry, EHHutchins, CAbad-Zapatero, Cvon Geldern, TW Benzoxazole benzenesulfonamides as allosteric inhibitors of fructose-1,6-bisphosphatase. Bioorg Med Chem Lett16:1807-10 (2006) 
 
Fructose-1,6-bisphosphatase 1
Name:Fructose-1,6-bisphosphatase 1
Type:Protein
Mol. Mass.:36843.58
Organism:Homo sapiens (Human)
Description:Liver FBPase (P09467)
Residue:338
BDBM50181348
NameBDBM50181348
Synonyms:2,6-dichloro-N-(5-chlorobenzo[d]oxazol-2-yl)benzenesulfonamide | CHEMBL380739
TypeSmall organic molecule
Emp. Form.C13H7Cl3N2O3S
Mol. Mass.377.63
SMILESClc1ccc2oc(NS(=O)(=O)c3c(Cl)cccc3Cl)nc2c1