Reaction Details
TargetFructose-1,6-bisphosphatase 1
LigandBDBM50181361
Substrate/Competitorn/a
Meas. Tech.ChEMBL_345422 (CHEMBL861116)
IC50>50000±n/a nM
Citation Lai, CGum, RJDaly, MFry, EHHutchins, CAbad-Zapatero, Cvon Geldern, TW Benzoxazole benzenesulfonamides as allosteric inhibitors of fructose-1,6-bisphosphatase. Bioorg Med Chem Lett16:1807-10 (2006) 
 
Fructose-1,6-bisphosphatase 1
Name:Fructose-1,6-bisphosphatase 1
Type:Protein
Mol. Mass.:36843.58
Organism:Homo sapiens (Human)
Description:Liver FBPase (P09467)
Residue:338
BDBM50181361
NameBDBM50181361
Synonyms:2,5-dichloro-N-(4-iodobenzo[d]oxazol-2-yl)benzenesulfonamide | CHEMBL203628
TypeSmall organic molecule
Emp. Form.C13H7Cl2IN2O3S
Mol. Mass.469.082
SMILESClc1ccc(Cl)c(c1)S(=O)(=O)Nc1nc2c(I)cccc2o1