Reaction Details
TargetFructose-1,6-bisphosphatase 1
LigandBDBM50181345
Substrate/Competitorn/a
Meas. Tech.ChEMBL_345422 (CHEMBL861116)
IC50 2600±n/a nM
Citation Lai, CGum, RJDaly, MFry, EHHutchins, CAbad-Zapatero, Cvon Geldern, TW Benzoxazole benzenesulfonamides as allosteric inhibitors of fructose-1,6-bisphosphatase. Bioorg Med Chem Lett16:1807-10 (2006) 
 
Fructose-1,6-bisphosphatase 1
Name:Fructose-1,6-bisphosphatase 1
Type:Protein
Mol. Mass.:36843.58
Organism:Homo sapiens (Human)
Description:Liver FBPase (P09467)
Residue:338
BDBM50181345
NameBDBM50181345
Synonyms:CHEMBL382008 | N-(7-(3-(aminomethyl)phenyl)-5-methoxybenzo[d]oxazol-2-yl)-2,5-dichlorobenzenesulfonamide
TypeSmall organic molecule
Emp. Form.C21H17Cl2N3O4S
Mol. Mass.478.348
SMILESCOc1cc(-c2cccc(CN)c2)c2oc(NS(=O)(=O)c3cc(Cl)ccc3Cl)nc2c1