Reaction Details
TargetFructose-1,6-bisphosphatase 1
LigandBDBM50181329
Substrate/Competitorn/a
Meas. Tech.ChEMBL_345422 (CHEMBL861116)
IC50 9400±n/a nM
Citation Lai, CGum, RJDaly, MFry, EHHutchins, CAbad-Zapatero, Cvon Geldern, TW Benzoxazole benzenesulfonamides as allosteric inhibitors of fructose-1,6-bisphosphatase. Bioorg Med Chem Lett16:1807-10 (2006) 
 
Fructose-1,6-bisphosphatase 1
Name:Fructose-1,6-bisphosphatase 1
Type:Protein
Mol. Mass.:36843.58
Organism:Homo sapiens (Human)
Description:Liver FBPase (P09467)
Residue:338
BDBM50181329
NameBDBM50181329
Synonyms:CHEMBL381803 | N-(5-chlorobenzo[d]oxazol-2-yl)-1-methyl-1H-imidazole-4-sulfonamide
TypeSmall organic molecule
Emp. Form.C11H9ClN4O3S
Mol. Mass.312.732
SMILESCn1cnc(c1)S(=O)(=O)Nc1nc2cc(Cl)ccc2o1