Reaction Details
TargetNociceptin receptor
LigandBDBM50181374
Substrate/Competitorn/a
Meas. Tech.ChEMBL_331366 (CHEMBL865853)
IC50 4±n/a nM
Citation Goto, YArai-Otsuki, STachibana, YIchikawa, DOzaki, STakahashi, HIwasawa, YOkamoto, OOkuda, SOhta, HSagara, T Identification of a novel spiropiperidine opioid receptor-like 1 antagonist class by a focused library approach featuring 3D-pharmacophore similarity. J Med Chem49:847-9 (2006) 
 
Nociceptin receptor
Name:Nociceptin receptor
Type:G Protein-Coupled Receptor (GPCR)
Mol. Mass.:40702.87
Organism:Homo sapiens (Human)
Description:P41146
Residue:370
BDBM50181374
NameBDBM50181374
Synonyms:2-phenoxy-N-[3-spiro(2,3-dihydro-1H-indene-1,4'-piperidine)-1-ylpropyl]benzamide | CHEMBL202443
TypeSmall organic molecule
Emp. Form.C29H32N2O2
Mol. Mass.440.5766
SMILESO=C(NCCCN1CCC2(CCc3ccccc23)CC1)c1ccccc1Oc1ccccc1