Reaction Details
TargetNociceptin receptor
LigandBDBM50181368
Substrate/Competitorn/a
Meas. Tech.ChEMBL_331362 (CHEMBL867087)
IC50>1000±n/a nM
Citation Goto, YArai-Otsuki, STachibana, YIchikawa, DOzaki, STakahashi, HIwasawa, YOkamoto, OOkuda, SOhta, HSagara, T Identification of a novel spiropiperidine opioid receptor-like 1 antagonist class by a focused library approach featuring 3D-pharmacophore similarity. J Med Chem49:847-9 (2006) 
 
Nociceptin receptor
Name:Nociceptin receptor
Type:G Protein-Coupled Receptor (GPCR)
Mol. Mass.:40702.87
Organism:Homo sapiens (Human)
Description:P41146
Residue:370
BDBM50181368
NameBDBM50181368
Synonyms:2-(2,3-dihydro-1H-inden-2-yl)-N-(3-{2,3-dihydrospiro[indene-1,4'-piperidine]-1'-yl}propyl)acetamide | CHEMBL202069
TypeSmall organic molecule
Emp. Form.C27H34N2O
Mol. Mass.402.5717
SMILESO=C(CC1Cc2ccccc2C1)NCCCN1CCC2(CCc3ccccc23)CC1