Reaction Details
TargetNociceptin receptor
LigandBDBM50181373
Substrate/Competitorn/a
Meas. Tech.ChEMBL_331362 (CHEMBL867087)
IC50 730±n/a nM
Citation Goto, YArai-Otsuki, STachibana, YIchikawa, DOzaki, STakahashi, HIwasawa, YOkamoto, OOkuda, SOhta, HSagara, T Identification of a novel spiropiperidine opioid receptor-like 1 antagonist class by a focused library approach featuring 3D-pharmacophore similarity. J Med Chem49:847-9 (2006) 
 
Nociceptin receptor
Name:Nociceptin receptor
Type:G Protein-Coupled Receptor (GPCR)
Mol. Mass.:40702.87
Organism:Homo sapiens (Human)
Description:P41146
Residue:370
BDBM50181373
NameBDBM50181373
Synonyms:(2E)-N-(3-{2,3-dihydrospiro[indene-1,4'-piperidine]-1'-yl}propyl)-3-phenylprop-2-enamide | CHEMBL201181
TypeSmall organic molecule
Emp. Form.C25H32N2O
Mol. Mass.376.5344
SMILESO=C(CCc1ccccc1)NCCCN1CCC2(CCc3ccccc23)CC1