Reaction Details
TargetMu-type opioid receptor
LigandBDBM50181382
Substrate/Competitorn/a
Meas. Tech.ChEMBL_331363 (CHEMBL867088)
IC50>10000±n/a nM
Citation Goto, YArai-Otsuki, STachibana, YIchikawa, DOzaki, STakahashi, HIwasawa, YOkamoto, OOkuda, SOhta, HSagara, T Identification of a novel spiropiperidine opioid receptor-like 1 antagonist class by a focused library approach featuring 3D-pharmacophore similarity. J Med Chem49:847-9 (2006) 
 
Mu-type opioid receptor
Name:Mu-type opioid receptor
Type:G Protein-Coupled Receptor (GPCR)
Mol. Mass.:44789.51
Organism:Homo sapiens (Human)
Description:P35372
Residue:400
BDBM50181382
NameBDBM50181382
Synonyms:CHEMBL199639 | N-[3-spiro(2,3-dihydro-1H-indene-1,4'-piperidine)-1-ylpropyl]-L-(-)-3-phenyllactoamide
TypeSmall organic molecule
Emp. Form.C25H32N2O2
Mol. Mass.392.5338
SMILESO[C@@H](Cc1ccccc1)C(=O)NCCCN1CCC2(CCc3ccccc23)CC1