Reaction Details
TargetNociceptin receptor
LigandBDBM50181418
Substrate/Competitorn/a
Meas. Tech.ChEMBL_331362 (CHEMBL867087)
IC50>1000±n/a nM
Citation Goto, YArai-Otsuki, STachibana, YIchikawa, DOzaki, STakahashi, HIwasawa, YOkamoto, OOkuda, SOhta, HSagara, T Identification of a novel spiropiperidine opioid receptor-like 1 antagonist class by a focused library approach featuring 3D-pharmacophore similarity. J Med Chem49:847-9 (2006) 
 
Nociceptin receptor
Name:Nociceptin receptor
Type:G Protein-Coupled Receptor (GPCR)
Mol. Mass.:40702.87
Organism:Homo sapiens (Human)
Description:P41146
Residue:370
BDBM50181418
NameBDBM50181418
Synonyms:2-(2,4-dichlorophenoxy)-N-(3-{2,3-dihydrospiro[indene-1,4'-piperidine]-1'-yl}propyl)propanamide | CHEMBL202442
TypeSmall organic molecule
Emp. Form.C25H30Cl2N2O2
Mol. Mass.461.424
SMILESCC(Oc1ccc(Cl)cc1Cl)C(=O)NCCCN1CCC2(CCc3ccccc23)CC1