Reaction Details
TargetCholecystokinin receptor type A
LigandBDBM50181435
Substrate/Competitorn/a
Meas. Tech.ChEMBL_330311 (CHEMBL871150)
IC50 470±n/a nM
Citation Hadac, EMDawson, ESDarrow, JWSugg, EELybrand, TPMiller, LJ Novel benzodiazepine photoaffinity probe stereoselectively labels a site deep within the membrane-spanning domain of the cholecystokinin receptor. J Med Chem49:850-63 (2006) 
 
Cholecystokinin receptor type A
Name:Cholecystokinin receptor type A
Type:Enzyme Catalytic Domain
Mol. Mass.:49676.37
Organism:RAT
Description:Cholecystokinin central 0 RAT::P30551
Residue:444
BDBM50181435
NameBDBM50181435
Synonyms:(R)-2-{3-[3-(4-Benzoylphenyl)ureido]-2,4-dioxo-5-phenyl-2,3,4,5-tetrahydrobenzo[b][1,4]diazepin-1-yl}-N-(4-methoxyphenyl)-N-methylacetamide | CHEMBL382263
TypeSmall organic molecule
Emp. Form.C39H33N5O6
Mol. Mass.667.7092
SMILESCOc1ccc(cc1)N(C)C(=O)CN1c2ccccc2N(c2ccccc2)C(=O)[C@H](NC(=O)Nc2cccc(c2)C(=O)c2ccccc2)C1=O