Reaction Details
TargetCholecystokinin receptor type A
LigandBDBM50181434
Substrate/Competitorn/a
Meas. Tech.ChEMBL_330311 (CHEMBL871150)
IC50 61±n/a nM
Citation Hadac, EMDawson, ESDarrow, JWSugg, EELybrand, TPMiller, LJ Novel benzodiazepine photoaffinity probe stereoselectively labels a site deep within the membrane-spanning domain of the cholecystokinin receptor. J Med Chem49:850-63 (2006) 
 
Cholecystokinin receptor type A
Name:Cholecystokinin receptor type A
Type:Enzyme Catalytic Domain
Mol. Mass.:49676.37
Organism:RAT
Description:Cholecystokinin central 0 RAT::P30551
Residue:444
BDBM50181434
NameBDBM50181434
Synonyms:(S)-2-{3-[3-(4-Benzoylphenyl)ureido]-2,4-dioxo-5-phenyl-2,3,4,5-tetrahydro-benzo[b][1,4]diazepin-1-yl}-N-isopropyl-N-(4-methoxyphenyl)acetamide | CHEMBL381347
TypeSmall organic molecule
Emp. Form.C41H37N5O6
Mol. Mass.695.7624
SMILESCOc1ccc(cc1)N(C(C)C)C(=O)CN1c2ccccc2N(c2ccccc2)C(=O)[C@@H](NC(=O)Nc2cccc(c2)C(=O)c2ccccc2)C1=O