Reaction Details
TargetRNA-directed RNA polymerase
LigandBDBM50181652
Substrate/Competitorn/a
Meas. Tech.ChEMBL_330651 (CHEMBL867029)
IC50 289±n/a nM
Citation Tedesco, RShaw, ANBambal, RChai, DConcha, NODarcy, MGDhanak, DFitch, DMGates, AGerhardt, WGHalegoua, DLHan, CHofmann, GAJohnston, VKKaura, ACLiu, NKeenan, RMLin-Goerke, JSarisky, RTWiggall, KJZimmerman, MNDuffy, KJ 3-(1,1-dioxo-2H-(1,2,4)-benzothiadiazin-3-yl)-4-hydroxy-2(1H)-quinolinones, potent inhibitors of hepatitis C virus RNA-dependent RNA polymerase. J Med Chem49:971-83 (2006) 
 
RNA-directed RNA polymerase
Name:RNA-directed RNA polymerase
Type:Protein
Mol. Mass.:25173.95
Organism:Hepatitis C virus
Description:Q8JXU8
Residue:229
BDBM50181652
NameBDBM50181652
Synonyms:3-(1,1-dioxo-2H-1,2,4-benzothiadiazin-3-yl)-4-hydroxy-1-(3-methyl-2-buten-1-yl)-1H-quinolin-2-one | CHEMBL381218
TypeSmall organic molecule
Emp. Form.C21H19N3O4S
Mol. Mass.409.458
SMILES[#6]\[#6](-[#6])=[#6]\[#6]-n1c2ccccc2c(-[#8])c(-[#6]-2=[#7]-c3ccccc3S(=O)(=O)[#7]-2)c1=O