Reaction Details
TargetRNA-directed RNA polymerase
LigandBDBM50181660
Substrate/Competitorn/a
Meas. Tech.ChEMBL_330651 (CHEMBL867029)
IC50 78±n/a nM
Citation Tedesco, RShaw, ANBambal, RChai, DConcha, NODarcy, MGDhanak, DFitch, DMGates, AGerhardt, WGHalegoua, DLHan, CHofmann, GAJohnston, VKKaura, ACLiu, NKeenan, RMLin-Goerke, JSarisky, RTWiggall, KJZimmerman, MNDuffy, KJ 3-(1,1-dioxo-2H-(1,2,4)-benzothiadiazin-3-yl)-4-hydroxy-2(1H)-quinolinones, potent inhibitors of hepatitis C virus RNA-dependent RNA polymerase. J Med Chem49:971-83 (2006) 
 
RNA-directed RNA polymerase
Name:RNA-directed RNA polymerase
Type:Protein
Mol. Mass.:25173.95
Organism:Hepatitis C virus
Description:Q8JXU8
Residue:229
BDBM50181660
NameBDBM50181660
Synonyms:3-(1,1-dioxo-1,2-dihydrobenzo[1,2,4]thiadiazin-3-yl)-4-hydroxy-1-(1-cyclopropylmethyl)-1H-quinolin-2-one | CHEMBL371635
TypeSmall organic molecule
Emp. Form.C20H17N3O4S
Mol. Mass.395.432
SMILESOc1c(C2=Nc3ccccc3S(=O)(=O)N2)c(=O)n(CC2CC2)c2ccccc12