Reaction Details
TargetRNA-directed RNA polymerase
LigandBDBM50181569
Substrate/Competitorn/a
Meas. Tech.ChEMBL_330651 (CHEMBL867029)
IC50 21±n/a nM
Citation Tedesco, RShaw, ANBambal, RChai, DConcha, NODarcy, MGDhanak, DFitch, DMGates, AGerhardt, WGHalegoua, DLHan, CHofmann, GAJohnston, VKKaura, ACLiu, NKeenan, RMLin-Goerke, JSarisky, RTWiggall, KJZimmerman, MNDuffy, KJ 3-(1,1-dioxo-2H-(1,2,4)-benzothiadiazin-3-yl)-4-hydroxy-2(1H)-quinolinones, potent inhibitors of hepatitis C virus RNA-dependent RNA polymerase. J Med Chem49:971-83 (2006) 
 
RNA-directed RNA polymerase
Name:RNA-directed RNA polymerase
Type:Protein
Mol. Mass.:25173.95
Organism:Hepatitis C virus
Description:Q8JXU8
Residue:229
BDBM50181569
NameBDBM50181569
Synonyms:CHEMBL425221 | [3-(1,1-dioxo-1,4-dihydrobenzo[1,2,4]thiadiazin-3-yl)-4-hydroxy-1-(3-methylbutyl)-1H-dihydroquinolin-6-ylamino]acetic acid
TypeSmall organic molecule
Emp. Form.C23H24N4O6S
Mol. Mass.484.525
SMILESCC(C)CCn1c2ccc(NCC(O)=O)cc2c(O)c(C2=Nc3ccccc3S(=O)(=O)N2)c1=O