Reaction Details
TargetRNA-directed RNA polymerase
LigandBDBM50181665
Substrate/Competitorn/a
Meas. Tech.ChEMBL_330651 (CHEMBL867029)
IC50 198±n/a nM
Citation Tedesco, RShaw, ANBambal, RChai, DConcha, NODarcy, MGDhanak, DFitch, DMGates, AGerhardt, WGHalegoua, DLHan, CHofmann, GAJohnston, VKKaura, ACLiu, NKeenan, RMLin-Goerke, JSarisky, RTWiggall, KJZimmerman, MNDuffy, KJ 3-(1,1-dioxo-2H-(1,2,4)-benzothiadiazin-3-yl)-4-hydroxy-2(1H)-quinolinones, potent inhibitors of hepatitis C virus RNA-dependent RNA polymerase. J Med Chem49:971-83 (2006) 
 
RNA-directed RNA polymerase
Name:RNA-directed RNA polymerase
Type:Protein
Mol. Mass.:25173.95
Organism:Hepatitis C virus
Description:Q8JXU8
Residue:229
BDBM50181665
NameBDBM50181665
Synonyms:3-(1,1-dioxo-1,4-dihydrobenzo[1,2,4]thiadiazin-3-yl)-4,6-dihydroxy-1-(3-methylbutyl)-1H-quinolin-2-one | CHEMBL202062
TypeSmall organic molecule
Emp. Form.C21H21N3O5S
Mol. Mass.427.474
SMILESCC(C)CCn1c2ccc(O)cc2c(O)c(C2=Nc3ccccc3S(=O)(=O)N2)c1=O