Reaction Details
TargetInsulin receptor
LigandBDBM50181670
Substrate/Competitorn/a
Meas. Tech.ChEMBL_331450 (CHEMBL867053)
Ki 8800±n/a nM
Citation Li, RXue, LZhu, TJiang, QCui, XYan, ZMcGee, DWang, JGantla, VRPickens, JCMcGrath, DChucholowski, AMorris, SWWebb, TR Design and synthesis of 5-aryl-pyridone-carboxamides as inhibitors of anaplastic lymphoma kinase. J Med Chem49:1006-15 (2006) 
 
Insulin receptor
Name:Insulin receptor
Type:Receptor Tyrosine Kinase
Mol. Mass.:156322.60
Organism:Homo sapiens (Human)
Description:P06213
Residue:1382
BDBM50181670
NameBDBM50181670
Synonyms:5-benzo[1,3]dioxol-5-yl-2-oxo-1,2-dihydro-pyridine-3-carboxylic acid [4-(4-methyl-piperazin-1-yl)-phenyl]-amide | CHEMBL436509
TypeSmall organic molecule
Emp. Form.C24H24N4O4
Mol. Mass.432.4718
SMILESCN1CCN(CC1)c1ccc(NC(=O)c2cc(c[nH]c2=O)-c2ccc3OCOc3c2)cc1