Reaction Details
TargetMetabotropic glutamate receptor 5
LigandBDBM50181745
Substrate/Competitorn/a
Meas. Tech.ChEMBL_331630 (CHEMBL864050)
IC50 0.94±n/a nM
Citation Iso, YGrajkowska, EWroblewski, JTDavis, JGoeders, NEJohnson, KMSanker, SRoth, BLTueckmantel, WKozikowski, AP Synthesis and structure-activity relationships of 3-[(2-methyl-1,3-thiazol-4-yl)ethynyl]pyridine analogues as potent, noncompetitive metabotropic glutamate receptor subtype 5 antagonists; search for cocaine medications. J Med Chem49:1080-100 (2006) 
 
Metabotropic glutamate receptor 5
Name:Metabotropic glutamate receptor 5
Type:Enzyme
Mol. Mass.:132484.72
Organism:Homo sapiens (Human)
Description:n/a
Residue:1212
BDBM50181745
NameBDBM50181745
Synonyms:3-[(2-methyl-4-thiazolyl)ethynyl]benzonitrile | CHEMBL201943
TypeSmall organic molecule
Emp. Form.C13H8N2S
Mol. Mass.224.281
SMILESCc1nc(cs1)C#Cc1cccc(c1)C#N