Reaction Details
TargetBcl-2-like protein 1
LigandBDBM50181870
Substrate/Competitorn/a
Meas. Tech.ChEMBL_332731 (CHEMBL859055)
Ki 5660±n/a nM
Citation Wendt, MDShen, WKunzer, AMcClellan, WJBruncko, MOost, TKDing, HJoseph, MKZhang, HNimmer, PMNg, SCShoemaker, ARPetros, AMOleksijew, AMarsh, KBauch, JOltersdorf, TBelli, BAMartineau, DFesik, SWRosenberg, SHElmore, SW Discovery and structure-activity relationship of antagonists of B-cell lymphoma 2 family proteins with chemopotentiation activity in vitro and in vivo. J Med Chem49:1165-81 (2006) 
 
Bcl-2-like protein 1
Name:Bcl-2-like protein 1
Type:Mitochondrion membrane; Single-pass membrane protein
Mol. Mass.:26039.60
Organism:Homo sapiens (Human)
Description:n/a
Residue:233
BDBM50181870
NameBDBM50181870
Synonyms:CHEMBL380433 | N-[4'-(3-dimethylaminopropyl)-2'-methoxybiphenyl-4-carbonyl]-3-nitro-4-(2-phenylsulfanylethylamino)benzenesulfonamide
TypeSmall organic molecule
Emp. Form.C33H36N4O6S2
Mol. Mass.648.792
SMILESCOc1cc(CCCN(C)C)ccc1-c1ccc(cc1)C(=O)NS(=O)(=O)c1ccc(NCCSc2ccccc2)c(c1)[N+]([O-])=O