Reaction Details
TargetBcl-2-like protein 1
LigandBDBM50181880
Substrate/Competitorn/a
Meas. Tech.ChEMBL_332729 (CHEMBL859053)
Ki 2.6±n/a nM
Citation Wendt, MDShen, WKunzer, AMcClellan, WJBruncko, MOost, TKDing, HJoseph, MKZhang, HNimmer, PMNg, SCShoemaker, ARPetros, AMOleksijew, AMarsh, KBauch, JOltersdorf, TBelli, BAMartineau, DFesik, SWRosenberg, SHElmore, SW Discovery and structure-activity relationship of antagonists of B-cell lymphoma 2 family proteins with chemopotentiation activity in vitro and in vivo. J Med Chem49:1165-81 (2006) 
 
Bcl-2-like protein 1
Name:Bcl-2-like protein 1
Type:Mitochondrion membrane; Single-pass membrane protein
Mol. Mass.:26039.60
Organism:Homo sapiens (Human)
Description:n/a
Residue:233
BDBM50181880
NameBDBM50181880
Synonyms:4-((R)-4-dimethylamino-1-phenylsulfanylmethylbutylamino)-N-[4-(4,4-dimethylpiperidin-1-yl)benzoyl]-3-nitrobenzenesulfonamide | CHEMBL380502
TypeSmall organic molecule
Emp. Form.C33H43N5O5S2
Mol. Mass.653.855
SMILESCN(C)CCC[C@H](CSc1ccccc1)Nc1ccc(cc1[N+]([O-])=O)S(=O)(=O)NC(=O)c1ccc(cc1)N1CCC(C)(C)CC1