Reaction Details
TargetBcl-2-like protein 1
LigandBDBM50181894
Substrate/Competitorn/a
Meas. Tech.ChEMBL_332730 (CHEMBL859054)
Ki 6050±n/a nM
Citation Wendt, MDShen, WKunzer, AMcClellan, WJBruncko, MOost, TKDing, HJoseph, MKZhang, HNimmer, PMNg, SCShoemaker, ARPetros, AMOleksijew, AMarsh, KBauch, JOltersdorf, TBelli, BAMartineau, DFesik, SWRosenberg, SHElmore, SW Discovery and structure-activity relationship of antagonists of B-cell lymphoma 2 family proteins with chemopotentiation activity in vitro and in vivo. J Med Chem49:1165-81 (2006) 
 
Bcl-2-like protein 1
Name:Bcl-2-like protein 1
Type:Mitochondrion membrane; Single-pass membrane protein
Mol. Mass.:26039.60
Organism:Homo sapiens (Human)
Description:n/a
Residue:233
BDBM50181894
NameBDBM50181894
Synonyms:CHEMBL378820 | N-[4-(4,4-dimethylpiperidin-1-yl)benzoyl]-4-((S)-3-morpholin-4-yl-1-phenylsulfanylmethylpropylamino)-3-nitrobenzenesulfonamide
TypeSmall organic molecule
Emp. Form.C34H43N5O6S2
Mol. Mass.681.865
SMILESCC1(C)CCN(CC1)c1ccc(cc1)C(=O)NS(=O)(=O)c1ccc(N[C@@H](CCN2CCOCC2)CSc2ccccc2)c(c1)[N+]([O-])=O