Reaction Details
TargetApoptosis regulator Bcl-2
LigandBDBM50181889
Substrate/Competitorn/a
Meas. Tech.ChEMBL_332728 (CHEMBL859052)
Ki 70±n/a nM
Citation Wendt, MDShen, WKunzer, AMcClellan, WJBruncko, MOost, TKDing, HJoseph, MKZhang, HNimmer, PMNg, SCShoemaker, ARPetros, AMOleksijew, AMarsh, KBauch, JOltersdorf, TBelli, BAMartineau, DFesik, SWRosenberg, SHElmore, SW Discovery and structure-activity relationship of antagonists of B-cell lymphoma 2 family proteins with chemopotentiation activity in vitro and in vivo. J Med Chem49:1165-81 (2006) 
 
Apoptosis regulator Bcl-2
Name:Apoptosis regulator Bcl-2
Type:Homodimer or heterodimer
Mol. Mass.:26269.11
Organism:Homo sapiens (Human)
Description:P10415
Residue:239
BDBM50181889
NameBDBM50181889
Synonyms:4-((R)-5-amino-1-phenylsulfanylmethylpentylamino)-N-[2'-methoxy-4'-(3-morpholin-4-ylpropyl)biphenyl-4-carbonyl]-3-nitrobenzenesulfonamide | CHEMBL380709
TypeSmall organic molecule
Emp. Form.C39H47N5O7S2
Mol. Mass.761.95
SMILESCOc1cc(CCCN2CCOCC2)ccc1-c1ccc(cc1)C(=O)NS(=O)(=O)c1ccc(N[C@H](CCCCN)CSc2ccccc2)c(c1)[N+]([O-])=O