Reaction Details
TargetApoptosis regulator Bcl-2
LigandBDBM50181888
Substrate/Competitorn/a
Meas. Tech.ChEMBL_332728 (CHEMBL859052)
Ki 55±n/a nM
Citation Wendt, MDShen, WKunzer, AMcClellan, WJBruncko, MOost, TKDing, HJoseph, MKZhang, HNimmer, PMNg, SCShoemaker, ARPetros, AMOleksijew, AMarsh, KBauch, JOltersdorf, TBelli, BAMartineau, DFesik, SWRosenberg, SHElmore, SW Discovery and structure-activity relationship of antagonists of B-cell lymphoma 2 family proteins with chemopotentiation activity in vitro and in vivo. J Med Chem49:1165-81 (2006) 
 
Apoptosis regulator Bcl-2
Name:Apoptosis regulator Bcl-2
Type:Homodimer or heterodimer
Mol. Mass.:26269.11
Organism:Homo sapiens (Human)
Description:P10415
Residue:239
BDBM50181888
NameBDBM50181888
Synonyms:CHEMBL198903 | N-[4-(4,4-dimethylpiperidin-1-yl)benzoyl]-4-((R)-3-morpholin-4-yl-1-phenylsulfanylmethylpropylamino)-3-nitrobenzenesulfonamide
TypeSmall organic molecule
Emp. Form.C34H43N5O6S2
Mol. Mass.681.865
SMILESCC1(C)CCN(CC1)c1ccc(cc1)C(=O)NS(=O)(=O)c1ccc(N[C@H](CCN2CCOCC2)CSc2ccccc2)c(c1)[N+]([O-])=O