Reaction Details
TargetCoagulation factor VII/Tissue factor
LigandBDBM50181916
Substrate/Competitorn/a
Meas. Tech.ChEMBL_347650 (CHEMBL870677)
Ki 2±n/a nM
Citation Kolesnikov, ARai, RYoung, WBMordenti, JLiu, LTorkelson, SShrader, WDLeahy, EMHu, HGjerstad, EJanc, JKatz, BASprengeler, PA Factor VIIa inhibitors: improved pharmacokinetic parameters. Bioorg Med Chem Lett16:2243-6 (2006) 
 
Coagulation factor VII/Tissue factor
Name:Coagulation factor VII/Tissue factor
Type:n/a
Mol. Mass.:n/a
Description:ASSAY_ID of EBI is 69535
Components:This complex has 2 components.
Component 1
Name:Tissue factor
Synonyms:CD_antigen=CD142 Coagulation factor VII/tissue factor TF Thromboplastin | Tissue factor
Type:PROTEIN
Mol. Mass.:33067.61
Organism:Homo sapiens (Human)
Description:ChEMBL_936735
Residue:295
Component 2
Name:Coagulation factor VII
Synonyms:Eptacog alfa FA7_HUMAN Factor VIIa (fVIIa) SPCA serum prothrombin conversion accelerator
Type:Enzyme
Mol. Mass.:51599.89
Organism:Homo sapiens (Human)
Description:n/a
Residue:466
BDBM50181916
NameBDBM50181916
Synonyms:CHEMBL206168 | [5-(5-carbamimidoyl-1H-benzoimidazol-2-yl)-5'-fluoro-6,2'-dihydroxy-biphenyl-3-yl]-acetic acid
TypeSmall organic molecule
Emp. Form.C22H17FN4O4
Mol. Mass.420.3932
SMILESNC(=N)c1ccc2nc([nH]c2c1)-c1cc(CC(O)=O)cc(c1O)-c1cc(F)ccc1O