Reaction Details
TargetRNA-directed RNA polymerase
LigandBDBM50181933
Substrate/Competitorn/a
Meas. Tech.ChEMBL_345618 (CHEMBL860683)
IC50 800±n/a nM
Citation Ishida, TSuzuki, THirashima, SMizutani, KYoshida, AAndo, IIkeda, SAdachi, THashimoto, H Benzimidazole inhibitors of hepatitis C virus NS5B polymerase: identification of 2-[(4-diarylmethoxy)phenyl]-benzimidazole. Bioorg Med Chem Lett16:1859-63 (2006) 
 
RNA-directed RNA polymerase
Name:RNA-directed RNA polymerase
Type:Protein
Mol. Mass.:25173.95
Organism:Hepatitis C virus
Description:Q8JXU8
Residue:229
BDBM50181933
NameBDBM50181933
Synonyms:2-(4-(bis(4-fluorophenyl)methoxy)phenyl)-1-cyclohexyl-1H-benzo[d]imidazole-5-carboxylic acid | CHEMBL205598
TypeSmall organic molecule
Emp. Form.C33H28F2N2O3
Mol. Mass.538.5838
SMILESOC(=O)c1ccc2n(C3CCCCC3)c(nc2c1)-c1ccc(OC(c2ccc(F)cc2)c2ccc(F)cc2)cc1