Reaction Details
TargetRNA-directed RNA polymerase
LigandBDBM50181935
Substrate/Competitorn/a
Meas. Tech.ChEMBL_345619 (CHEMBL860686)
IC50 2200±n/a nM
Citation Ishida, TSuzuki, THirashima, SMizutani, KYoshida, AAndo, IIkeda, SAdachi, THashimoto, H Benzimidazole inhibitors of hepatitis C virus NS5B polymerase: identification of 2-[(4-diarylmethoxy)phenyl]-benzimidazole. Bioorg Med Chem Lett16:1859-63 (2006) 
 
RNA-directed RNA polymerase
Name:RNA-directed RNA polymerase
Type:Protein
Mol. Mass.:25173.95
Organism:Hepatitis C virus
Description:Q8JXU8
Residue:229
BDBM50181935
NameBDBM50181935
Synonyms:1-Cyclohexyl-2-[4-(di-pyridin-3-yl-methoxy)-2-fluoro-phenyl]-1H-benzoimidazole-5-carboxylic acid | CHEMBL383304
TypeSmall organic molecule
Emp. Form.C31H27FN4O3
Mol. Mass.522.5695
SMILESOC(=O)c1ccc2n(C3CCCCC3)c(nc2c1)-c1ccc(OC(c2cccnc2)c2cccnc2)cc1F