Reaction Details
TargetRNA-directed RNA polymerase
LigandBDBM50181925
Substrate/Competitorn/a
Meas. Tech.ChEMBL_345618 (CHEMBL860683)
IC50 1000±n/a nM
Citation Ishida, TSuzuki, THirashima, SMizutani, KYoshida, AAndo, IIkeda, SAdachi, THashimoto, H Benzimidazole inhibitors of hepatitis C virus NS5B polymerase: identification of 2-[(4-diarylmethoxy)phenyl]-benzimidazole. Bioorg Med Chem Lett16:1859-63 (2006) 
 
RNA-directed RNA polymerase
Name:RNA-directed RNA polymerase
Type:Protein
Mol. Mass.:25173.95
Organism:Hepatitis C virus
Description:Q8JXU8
Residue:229
BDBM50181925
NameBDBM50181925
Synonyms:1-cyclohexyl-2-(4-(5-phenylpentyloxy)phenyl)-1H-benzo[d]imidazole-5-carboxylic acid | CHEMBL205842
TypeSmall organic molecule
Emp. Form.C31H34N2O3
Mol. Mass.482.6133
SMILESOC(=O)c1ccc2n(C3CCCCC3)c(nc2c1)-c1ccc(OCCCCCc2ccccc2)cc1