Reaction Details
TargetRNA-directed RNA polymerase
LigandBDBM50181958
Substrate/Competitorn/a
Meas. Tech.ChEMBL_347313 (CHEMBL865646)
IC50 88±n/a nM
Citation Evans, KAChai, DGraybill, TLBurton, GSarisky, RTLin-Goerke, JJohnston, VKRivero, RA An efficient, asymmetric solid-phase synthesis of benzothiadiazine-substituted tetramic acids: potent inhibitors of the hepatitis C virus RNA-dependent RNA polymerase. Bioorg Med Chem Lett16:2205-8 (2006) 
 
RNA-directed RNA polymerase
Name:RNA-directed RNA polymerase
Type:Protein
Mol. Mass.:25173.95
Organism:Hepatitis C virus
Description:Q8JXU8
Residue:229
BDBM50181958
NameBDBM50181958
Synonyms:(S)-1-benzyl-5-sec-butyl-3-(1,1-dioxo-1,4-dihydro-1-benzo[1,2,4]thiadiazin-3-yl)-4-hydroxy-1,5-dihydro-pyrrol-2-one | CHEMBL205579
TypeSmall organic molecule
Emp. Form.C22H23N3O4S
Mol. Mass.425.501
SMILESCCC(C)[C@@H]1N(Cc2ccccc2)C(=O)C(C1=O)C1=Nc2ccccc2S(=O)(=O)N1