Reaction Details
TargetFocal adhesion kinase 1
LigandBDBM50181968
Substrate/Competitorn/a
Meas. Tech.ChEMBL_347197 (CHEMBL865637)
IC50 300±n/a nM
Citation Choi, HSWang, ZRichmond, WHe, XYang, KJiang, TSim, TKaranewsky, DGu, XJZhou, VLiu, YOhmori, OCaldwell, JGray, NHe, Y Design and synthesis of 7H-pyrrolo[2,3-d]pyrimidines as focal adhesion kinase inhibitors. Part 1. Bioorg Med Chem Lett16:2173-6 (2006) 
 
Focal adhesion kinase 1
Name:Focal adhesion kinase 1
Type:Tyrosine-protein kinase
Mol. Mass.:119233.17
Organism:Homo sapiens (Human)
Description:Q05397
Residue:1052
BDBM50181968
NameBDBM50181968
Synonyms:7-(pyridin-2-yl)-N-(5,6,7,8-tetrahydronaphthalen-1-yl)-7H-pyrrolo[2,3-d]pyrimidin-2-amine | CHEMBL382809
TypeSmall organic molecule
Emp. Form.C21H19N5
Mol. Mass.341.4091
SMILESC1CCc2c(C1)cccc2Nc1ncc2ccn(-c3ccccn3)c2n1