Reaction Details
TargetFocal adhesion kinase 1
LigandBDBM50182002
Substrate/Competitorn/a
Meas. Tech.ChEMBL_347197 (CHEMBL865637)
IC50 400±n/a nM
Citation Choi, HSWang, ZRichmond, WHe, XYang, KJiang, TSim, TKaranewsky, DGu, XJZhou, VLiu, YOhmori, OCaldwell, JGray, NHe, Y Design and synthesis of 7H-pyrrolo[2,3-d]pyrimidines as focal adhesion kinase inhibitors. Part 1. Bioorg Med Chem Lett16:2173-6 (2006) 
 
Focal adhesion kinase 1
Name:Focal adhesion kinase 1
Type:Tyrosine-protein kinase
Mol. Mass.:119233.17
Organism:Homo sapiens (Human)
Description:Q05397
Residue:1052
BDBM50182002
NameBDBM50182002
Synonyms:4-methyl-3-(7-(pyridin-2-yl)-7H-pyrrolo[2,3-d]pyrimidin-2-ylamino)benzamide | CHEMBL379118
TypeSmall organic molecule
Emp. Form.C19H16N6O
Mol. Mass.344.3699
SMILESCc1ccc(cc1Nc1ncc2ccn(-c3ccccn3)c2n1)C(N)=O