Reaction Details
TargetFocal adhesion kinase 1
LigandBDBM50182017
Substrate/Competitorn/a
Meas. Tech.ChEMBL_347197 (CHEMBL865637)
IC50>10000±n/a nM
Citation Choi, HSWang, ZRichmond, WHe, XYang, KJiang, TSim, TKaranewsky, DGu, XJZhou, VLiu, YOhmori, OCaldwell, JGray, NHe, Y Design and synthesis of 7H-pyrrolo[2,3-d]pyrimidines as focal adhesion kinase inhibitors. Part 1. Bioorg Med Chem Lett16:2173-6 (2006) 
 
Focal adhesion kinase 1
Name:Focal adhesion kinase 1
Type:Tyrosine-protein kinase
Mol. Mass.:119233.17
Organism:Homo sapiens (Human)
Description:Q05397
Residue:1052
BDBM50182017
NameBDBM50182017
Synonyms:7-(pyridin-2-yl)-2-(3,4,5-trimethoxyphenylamino)-5H-pyrrolo[2,3-d]pyrimidin-6(7H)-one | CHEMBL205368
TypeSmall organic molecule
Emp. Form.C20H19N5O4
Mol. Mass.393.396
SMILESCOc1cc(Nc2ncc3CC(=O)N(c3n2)c2ccccn2)cc(OC)c1OC