Reaction Details
TargetHLA class II histocompatibility antigen gamma chain
LigandBDBM50182095
Substrate/Competitorn/a
Meas. Tech.ChEMBL_347360 (CHEMBL865649)
IC50 1100±n/a nM
Citation Grice, CATays, KKhatuya, HGustin, DJButler, CRWei, JSehon, CASun, SGu, YJiang, WThurmond, RLKarlsson, LEdwards, JP The SAR of 4-substituted (6,6-bicyclic) piperidine cathepsin S inhibitors. Bioorg Med Chem Lett16:2209-12 (2006) 
 
HLA class II histocompatibility antigen gamma chain
Name:HLA class II histocompatibility antigen gamma chain
Type:PROTEIN
Mol. Mass.:33525.85
Organism:Homo sapiens (Human)
Description:ChEMBL_347360
Residue:296
BDBM50182095
NameBDBM50182095
Synonyms:1-(1-(3-(3-(4-bromophenyl)-5-(methylsulfonyl)-4,5,6,7-tetrahydropyrazolo[4,3-c]pyridin-1-yl)-2-hydroxypropyl)piperidin-4-yl)-3,4-dihydroquinazolin-2(1H)-one | CHEMBL205748
TypeSmall organic molecule
Emp. Form.C29H35BrN6O4S
Mol. Mass.643.595
SMILESCS(=O)(=O)N1CCc2c(C1)c(nn2CC(O)CN1CCC(CC1)N1C(=O)NCc2ccccc12)-c1ccc(Br)cc1