Reaction Details
TargetHLA class II histocompatibility antigen gamma chain
LigandBDBM50182103
Substrate/Competitorn/a
Meas. Tech.ChEMBL_347360 (CHEMBL865649)
IC50 1300±n/a nM
Citation Grice, CATays, KKhatuya, HGustin, DJButler, CRWei, JSehon, CASun, SGu, YJiang, WThurmond, RLKarlsson, LEdwards, JP The SAR of 4-substituted (6,6-bicyclic) piperidine cathepsin S inhibitors. Bioorg Med Chem Lett16:2209-12 (2006) 
 
HLA class II histocompatibility antigen gamma chain
Name:HLA class II histocompatibility antigen gamma chain
Type:PROTEIN
Mol. Mass.:33525.85
Organism:Homo sapiens (Human)
Description:ChEMBL_347360
Residue:296
BDBM50182103
NameBDBM50182103
Synonyms:6-chloro-4-(1-(2-hydroxy-3-(5-(methylsulfonyl)-3-(4-(trifluoromethyl)phenyl)-4,5,6,7-tetrahydropyrazolo[4,3-c]pyridin-1-yl)propyl)piperidin-4-yl)-2H-benzo[b][1,4]oxazin-3(4H)-one | CHEMBL414587
TypeSmall organic molecule
Emp. Form.C30H33ClF3N5O5S
Mol. Mass.668.127
SMILESCS(=O)(=O)N1CCc2c(C1)c(nn2CC(O)CN1CCC(CC1)N1C(=O)COc2ccc(Cl)cc12)-c1ccc(cc1)C(F)(F)F