Reaction Details
TargetTyrosine-protein phosphatase non-receptor type 1
LigandBDBM50182134
Substrate/Competitorn/a
Meas. Tech.ChEMBL_347009 (CHEMBL864995)
Ki 30000±n/a nM
Citation Ahmad, GMishra, PKGupta, PYadav, PPTiwari, PTamrakar, AKSrivastava, AKMaurya, R Synthesis of novel benzofuran isoxazolines as protein tyrosine phosphatase 1B inhibitors. Bioorg Med Chem Lett16:2139-43 (2006) 
 
Tyrosine-protein phosphatase non-receptor type 1
Name:Tyrosine-protein phosphatase non-receptor type 1
Type:Protein phosphatase
Mol. Mass.:49963.76
Organism:Homo sapiens (Human)
Description:Human recombinant GST-fusion PTP1B (1-435).
Residue:435
BDBM50182134
NameBDBM50182134
Synonyms:3-(4,7-dimethoxybenzofuran-5-yl)-5-phenyl-4,5-dihydroisoxazole | CHEMBL202917
TypeSmall organic molecule
Emp. Form.C19H17NO4
Mol. Mass.323.3426
SMILESCOc1cc(C2=NOC(C2)c2ccccc2)c(OC)c2ccoc12