Reaction Details
TargetCoagulation factor X
LigandBDBM50182163
Substrate/Competitorn/a
Meas. Tech.ChEBML_347238
Ki 11400±n/a nM
Citation Subasinghe, NLTravins, JMAli, FHuang, HBallentine, SKMarugán, JJKhalil, EHufnagel, HRBone, RFDesJarlais, RLCrysler, CSNinan, NCummings, MDMolloy, CJTomczuk, BE A novel series of arylsulfonylthiophene-2-carboxamidine inhibitors of the complement component C1s. Bioorg Med Chem Lett16:2200-4 (2006) 
 
Coagulation factor X
Name:Coagulation factor X
Type:Enzyme
Mol. Mass.:54726.60
Organism:Homo sapiens (Human)
Description:n/a
Residue:488
BDBM50182163
NameBDBM50182163
Synonyms:4-[7-bromo-1-(2,5-difluoro-benzyl)-1H-benzoimidazole-5-sulfonyl]-5-methylsulfanyl-thiophene-2-carboxamidine | CHEMBL205904
TypeSmall organic molecule
Emp. Form.C20H15BrF2N4O2S3
Mol. Mass.557.455
SMILESCSc1sc(cc1S(=O)(=O)c1cc(Br)c2n(Cc3cc(F)ccc3F)cnc2c1)C(N)=N