Reaction Details
TargetComplement C1s subcomponent
LigandBDBM50182180
Substrate/Competitorn/a
Meas. Tech.ChEBML_347235
Ki 180±n/a nM
Citation Subasinghe, NLTravins, JMAli, FHuang, HBallentine, SKMarugán, JJKhalil, EHufnagel, HRBone, RFDesJarlais, RLCrysler, CSNinan, NCummings, MDMolloy, CJTomczuk, BE A novel series of arylsulfonylthiophene-2-carboxamidine inhibitors of the complement component C1s. Bioorg Med Chem Lett16:2200-4 (2006) 
 
Complement C1s subcomponent
Name:Complement C1s subcomponent
Type:Protein
Mol. Mass.:76657.91
Organism:Homo sapiens (Human)
Description:P09871
Residue:688
BDBM50182180
NameBDBM50182180
Synonyms:4-(7-bromo-3-phenyl-3H-benzoimidazole-5-sulfonyl)-5-methylsulfanyl-thiophene-2-carboxamidine | CHEMBL205342
TypeSmall organic molecule
Emp. Form.C19H15BrN4O2S3
Mol. Mass.507.447
SMILESCSc1sc(cc1S(=O)(=O)c1cc(Br)c2ncn(-c3ccccc3)c2c1)C(N)=N