Reaction Details
TargetAdenosine receptor A3
LigandBDBM50182322
Substrate/Competitorn/a
Meas. Tech.ChEMBL_349357 (CHEMBL865062)
Ki 3.9±n/a nM
Citation DeNinno, MPMasamune, HChenard, LKDiRico, KJEller, CEtienne, JBTickner, JEKennedy, SPKnight, DRKong, JOleynek, JJTracey, WRHill, RJ The synthesis of highly potent, selective, and water-soluble agonists at the human adenosine A3 receptor. Bioorg Med Chem Lett16:2525-7 (2006) 
 
Adenosine receptor A3
Name:Adenosine receptor A3
Type:G Protein-Coupled Receptor (GPCR)
Mol. Mass.:36197.32
Organism:Homo sapiens (Human)
Description:P0DMS8
Residue:318
BDBM50182322
NameBDBM50182322
Synonyms:(2S,3S,4R,5R)-5-(6-(2,5-dimethoxybenzylamino)-9H-purin-9-yl)-3,4-dihydroxy-N-methyl-tetrahydrofuran-2-carboxamide | CHEMBL378150
TypeSmall organic molecule
Emp. Form.C20H24N6O6
Mol. Mass.444.4412
SMILESCNC(=O)[C@H]1O[C@H]([C@H](O)[C@@H]1O)n1cnc2c(NCc3cc(OC)ccc3OC)ncnc12