Reaction Details
TargetAdenosine receptor A3
LigandBDBM50122927
Substrate/Competitorn/a
Meas. Tech.ChEMBL_349357 (CHEMBL865062)
Ki 4.8±n/a nM
Citation DeNinno, MPMasamune, HChenard, LKDiRico, KJEller, CEtienne, JBTickner, JEKennedy, SPKnight, DRKong, JOleynek, JJTracey, WRHill, RJ The synthesis of highly potent, selective, and water-soluble agonists at the human adenosine A3 receptor. Bioorg Med Chem Lett16:2525-7 (2006) 
 
Adenosine receptor A3
Name:Adenosine receptor A3
Type:G Protein-Coupled Receptor (GPCR)
Mol. Mass.:36197.32
Organism:Homo sapiens (Human)
Description:P0DMS8
Residue:318
BDBM50122927
NameBDBM50122927
Synonyms:(2S,3S,4R,5R)-3,4-dihydroxy-N-methyl-5-(6-(methylamino)-9H-purin-9-yl)-tetrahydrofuran-2-carboxamide CHEMBL413507
TypeSmall organic molecule
Emp. Form.C12H16N6O4
Mol. Mass.308.2932
SMILESCNC(=O)[C@H]1O[C@H]([C@H](O)[C@@H]1O)n1cnc2c(NC)ncnc12