Reaction Details
TargetProstaglandin G/H synthase 2
LigandBDBM50182346
Substrate/Competitorn/a
Meas. Tech.ChEMBL_344386 (CHEMBL865438)
IC50 65±n/a nM
Citation Cheng, HLundy DeMello, KMLi, JSakya, SMAndo, KKawamura, KKato, TRafka, RJJaynes, BHZiegler, CBStevens, RLund, LAMann, DWKilroy, CHaven, MLNimz, ELDutra, JKLi, CMinich, MLKolosko, NLPetras, CSilvia, AMSeibel, SB Synthesis and SAR of heteroaryl-phenyl-substituted pyrazole derivatives as highly selective and potent canine COX-2 inhibitors. Bioorg Med Chem Lett16:2076-80 (2006) 
 
Prostaglandin G/H synthase 2
Name:Prostaglandin G/H synthase 2
Type:PROTEIN
Mol. Mass.:68982.35
Organism:Canis familiaris
Description:ChEMBL_344386
Residue:604
BDBM50182346
NameBDBM50182346
Synonyms:2-(5-(3-methyl-4-(oxazol-2-yl)phenyl)-3-(trifluoromethyl)-1H-pyrazol-1-yl)-5-(methylsulfonyl)pyridine | CHEMBL205331
TypeSmall organic molecule
Emp. Form.C20H15F3N4O3S
Mol. Mass.448.418
SMILESCc1cc(ccc1-c1ncco1)-c1cc(nn1-c1ccc(cn1)S(C)(=O)=O)C(F)(F)F