Reaction Details
Target72 kDa type IV collagenase
LigandBDBM50182403
Substrate/Competitorn/a
Meas. Tech.ChEMBL_350091 (CHEMBL865072)
Ki 7±n/a nM
Citation Thompson, LALiauw, AYRamanjulu, MMKasireddy-Polam, PMercer, SEMaduskuie, TPGlicksman, MRoach, AHMeredith, JELiu, RQCombs, APHigaki, JNCordell, BSeiffert, DZaczek, RCRobertson, DWOlson, RE Synthesis and evaluation of succinoyl-caprolactam gamma-secretase inhibitors. Bioorg Med Chem Lett16:2357-63 (2006) 
 
72 kDa type IV collagenase
Name:72 kDa type IV collagenase
Type:Enzyme
Mol. Mass.:73870.36
Organism:Homo sapiens (Human)
Description: P08253
Residue:660
BDBM50182403
NameBDBM50182403
Synonyms:(2R,3S)-N1-((S)-1-(3-phenoxybenzyl)-2-oxoazepan-3-yl)-N4-hydroxy-2-isobutyl-3-propylsuccinamide CHEMBL204357 | SR-973
TypeSmall organic molecule
Emp. Form.C30H41N3O5
Mol. Mass.523.6636
SMILESCCC[C@@H]([C@@H](CC(C)C)C(=O)N[C@H]1CCCCN(Cc2cccc(Oc3ccccc3)c2)C1=O)C(=O)NO