Reaction Details
TargetAmyloid-beta precursor protein
LigandBDBM50410867
Substrate/Competitorn/a
Meas. Tech.ChEMBL_350088 (CHEMBL865069)
IC50 160±n/a nM
Citation Thompson, LALiauw, AYRamanjulu, MMKasireddy-Polam, PMercer, SEMaduskuie, TPGlicksman, MRoach, AHMeredith, JELiu, RQCombs, APHigaki, JNCordell, BSeiffert, DZaczek, RCRobertson, DWOlson, RE Synthesis and evaluation of succinoyl-caprolactam gamma-secretase inhibitors. Bioorg Med Chem Lett16:2357-63 (2006) 
 
Amyloid-beta precursor protein
Name:Amyloid-beta precursor protein
Type:Single-pass type I membrane protein
Mol. Mass.:86890.41
Organism:Homo sapiens (Human)
Description:P05067
Residue:770
BDBM50410867
NameBDBM50410867
Synonyms:CHEMBL274414
TypeSmall organic molecule
Emp. Form.C31H44N4O4
Mol. Mass.536.7055
SMILESCCC[C@@H]([C@@H](CC(C)C)C(=O)N[C@H]1CCCCN(Cc2cccc(Nc3ccc(OC)cc3)c2)C1=O)C(N)=O