Reaction Details
TargetBeta-glucosidase
LigandBDBM18351
Substrate/Competitorn/a
Meas. Tech.ChEMBL_344324 (CHEMBL867768)
Ki 12000±n/a nM
Citation Greimel, PHäusler, HLundt, IRupitz, KStütz, AETarling, CAWithers, SGWrodnigg, TM Fluorescent glycosidase inhibiting 1,5-dideoxy-1,5-iminoalditols. Bioorg Med Chem Lett16:2067-70 (2006) 
 
Beta-glucosidase
Name:Beta-glucosidase
Type:PROTEIN
Mol. Mass.:88266.88
Organism:Agrobacterium tumefaciens
Description:ChEMBL_1366789
Residue:818
BDBM18351
NameBDBM18351
Synonyms:(2R,3R,4R,5S)-2-(Hydroxymethyl)piperidine-3,4,5-triol, 10 1-Deoxynojirimycin CHEMBL307429 US9181184, 1 | dNM
Typenatural product
Emp. Form.C6H13NO4
Mol. Mass.163.1717
SMILESOC[C@H]1NC[C@H](O)[C@@H](O)[C@@H]1O