Reaction Details
TargetMu-type opioid receptor
LigandBDBM50154036
Substrate/Competitorn/a
Meas. Tech.ChEMBL_349386 (CHEMBL863863)
Ki 55±n/a nM
Citation Breslin, HJCai, CMiskowski, TACoutinho, SVZhang, SPHornby, PHe, W Identification of potent phenyl imidazoles as opioid receptor agonists. Bioorg Med Chem Lett16:2505-8 (2006) 
 
Mu-type opioid receptor
Name:Mu-type opioid receptor
Type:G Protein-Coupled Receptor (GPCR)
Mol. Mass.:44503.11
Organism:Rattus norvegicus (rat)
Description:Competition binding assays were carried out using membrane preparations from transfected HN9.10 cells that constitutively expressed the mu opioid receptor.
Residue:398
BDBM50154036
NameBDBM50154036
Synonyms:(S)-2-amino-3-(4-hydroxyphenyl)-1-((S)-3-(4-phenyl-1H-imidazol-2-yl)-3,4-dihydroisoquinolin-2(1H)-yl)propan-1-one CHEMBL361274
TypeSmall organic molecule
Emp. Form.C27H26N4O2
Mol. Mass.438.5209
SMILESN[C@@H](Cc1ccc(O)cc1)C(=O)N1Cc2ccccc2C[C@H]1c1nc(c[nH]1)-c1ccccc1