Reaction Details
TargetMu-type opioid receptor
LigandBDBM50182939
Substrate/Competitorn/a
Meas. Tech.ChEMBL_349389 (CHEMBL865710)
EC50 2±n/a nM
Citation Breslin, HJCai, CMiskowski, TACoutinho, SVZhang, SPHornby, PHe, W Identification of potent phenyl imidazoles as opioid receptor agonists. Bioorg Med Chem Lett16:2505-8 (2006) 
 
Mu-type opioid receptor
Name:Mu-type opioid receptor
Type:Enzyme Catalytic Domain
Mol. Mass.:11165.58
Organism:GUINEA PIG
Description:P97266
Residue:98
BDBM50182939
NameBDBM50182939
Synonyms:(S)-2-amino-3-(4-hydroxy-2,6-dimethylphenyl)-1-((S)-2-(4-phenyl-1H-imidazol-2-yl)piperidin-1-yl)propan-1-one | CHEMBL377069
TypeSmall organic molecule
Emp. Form.C25H30N4O2
Mol. Mass.418.5313
SMILESCc1cc(O)cc(C)c1C[C@H](N)C(=O)N1CCCC[C@H]1c1nc(c[nH]1)-c1ccccc1