Reaction Details
TargetDelta-type opioid receptor
LigandBDBM50182950
Substrate/Competitorn/a
Meas. Tech.ChEMBL_349385 (CHEMBL863860)
Ki 30±n/a nM
Citation Breslin, HJCai, CMiskowski, TACoutinho, SVZhang, SPHornby, PHe, W Identification of potent phenyl imidazoles as opioid receptor agonists. Bioorg Med Chem Lett16:2505-8 (2006) 
 
Delta-type opioid receptor
Name:Delta-type opioid receptor
Type:G Protein-Coupled Receptor (GPCR)
Mol. Mass.:40465.04
Organism:Rattus norvegicus (rat)
Description:Competition binding assays were using CHO-K1 cell membranes expressing the opioid receptor.
Residue:372
BDBM50182950
NameBDBM50182950
Synonyms:(S)-3-(4-acetylphenyl)-2-amino-1-((S)-3-(4-phenyl-1H-imidazol-2-yl)-3,4-dihydroisoquinolin-2(1H)-yl)propan-1-one | CHEMBL207976
TypeSmall organic molecule
Emp. Form.C29H28N4O2
Mol. Mass.464.5582
SMILESCC(=O)c1ccc(C[C@H](N)C(=O)N2Cc3ccccc3C[C@H]2c2nc(c[nH]2)-c2ccccc2)cc1