Reaction Details
TargetDelta-type opioid receptor
LigandBDBM50182954
Substrate/Competitorn/a
Meas. Tech.ChEMBL_349385 (CHEMBL863860)
Ki 0.1±n/a nM
Citation Breslin, HJCai, CMiskowski, TACoutinho, SVZhang, SPHornby, PHe, W Identification of potent phenyl imidazoles as opioid receptor agonists. Bioorg Med Chem Lett16:2505-8 (2006) 
 
Delta-type opioid receptor
Name:Delta-type opioid receptor
Type:G Protein-Coupled Receptor (GPCR)
Mol. Mass.:40465.04
Organism:Rattus norvegicus (rat)
Description:Competition binding assays were using CHO-K1 cell membranes expressing the opioid receptor.
Residue:372
BDBM50182954
NameBDBM50182954
Synonyms:(S)-2-amino-3-(4-hydroxy-2,6-dimethylphenyl)-1-((S)-3-(5-methyl-4-phenyl-1H-imidazol-2-yl)-3,4-dihydroisoquinolin-2(1H)-yl)propan-1-one | CHEMBL208461
TypeSmall organic molecule
Emp. Form.C30H32N4O2
Mol. Mass.480.6007
SMILESCc1[nH]c(nc1-c1ccccc1)[C@@H]1Cc2ccccc2CN1C(=O)[C@@H](N)Cc1c(C)cc(O)cc1C