Reaction Details
TargetDelta-type opioid receptor
LigandBDBM50182939
Substrate/Competitorn/a
Meas. Tech.ChEMBL_349385 (CHEMBL863860)
Ki 1.9±n/a nM
Citation Breslin, HJCai, CMiskowski, TACoutinho, SVZhang, SPHornby, PHe, W Identification of potent phenyl imidazoles as opioid receptor agonists. Bioorg Med Chem Lett16:2505-8 (2006) 
 
Delta-type opioid receptor
Name:Delta-type opioid receptor
Type:G Protein-Coupled Receptor (GPCR)
Mol. Mass.:40465.04
Organism:Rattus norvegicus (rat)
Description:Competition binding assays were using CHO-K1 cell membranes expressing the opioid receptor.
Residue:372
BDBM50182939
NameBDBM50182939
Synonyms:(S)-2-amino-3-(4-hydroxy-2,6-dimethylphenyl)-1-((S)-2-(4-phenyl-1H-imidazol-2-yl)piperidin-1-yl)propan-1-one | CHEMBL377069
TypeSmall organic molecule
Emp. Form.C25H30N4O2
Mol. Mass.418.5313
SMILESCc1cc(O)cc(C)c1C[C@H](N)C(=O)N1CCCC[C@H]1c1nc(c[nH]1)-c1ccccc1