Reaction Details
TargetDelta-type opioid receptor
LigandBDBM50182944
Substrate/Competitorn/a
Meas. Tech.ChEMBL_349388 (CHEMBL865695)
EC50 730±n/a nM
Citation Breslin, HJCai, CMiskowski, TACoutinho, SVZhang, SPHornby, PHe, W Identification of potent phenyl imidazoles as opioid receptor agonists. Bioorg Med Chem Lett16:2505-8 (2006) 
 
Delta-type opioid receptor
Name:Delta-type opioid receptor
Type:Enzyme Catalytic Domain
Mol. Mass.:40577.25
Organism:MOUSE
Description:P32300
Residue:372
BDBM50182944
NameBDBM50182944
Synonyms:4-((S)-2-amino-3-oxo-3-((S)-2-(4-phenyl-1H-imidazol-2-yl)piperidin-1-yl)propyl)benzamide | CHEMBL204996
TypeSmall organic molecule
Emp. Form.C24H27N5O2
Mol. Mass.417.5035
SMILESN[C@@H](Cc1ccc(cc1)C(N)=O)C(=O)N1CCCC[C@H]1c1nc(c[nH]1)-c1ccccc1