Reaction Details
TargetMu-type opioid receptor
LigandBDBM50154041
Substrate/Competitorn/a
Meas. Tech.ChEMBL_349386 (CHEMBL863863)
Ki 1.5±n/a nM
Citation Breslin, HJCai, CMiskowski, TACoutinho, SVZhang, SPHornby, PHe, W Identification of potent phenyl imidazoles as opioid receptor agonists. Bioorg Med Chem Lett16:2505-8 (2006) 
 
Mu-type opioid receptor
Name:Mu-type opioid receptor
Type:G Protein-Coupled Receptor (GPCR)
Mol. Mass.:44503.11
Organism:Rattus norvegicus (rat)
Description:Competition binding assays were carried out using membrane preparations from transfected HN9.10 cells that constitutively expressed the mu opioid receptor.
Residue:398
BDBM50154041
NameBDBM50154041
Synonyms:(S)-2-amino-3-(4-hydroxyphenyl)-1-((S)-2-(5-methyl-4-phenyl-1H-imidazol-2-yl)piperidin-1-yl)propan-1-one CHEMBL366311
TypeSmall organic molecule
Emp. Form.C24H28N4O2
Mol. Mass.404.5047
SMILESCc1[nH]c(nc1-c1ccccc1)[C@@H]1CCCCN1C(=O)[C@@H](N)Cc1ccc(O)cc1