Reaction Details
TargetCytochrome P450 2C8
LigandBDBM50183079
Substrate/Competitorn/a
Meas. Tech.ChEMBL_350783 (CHEMBL869681)
IC50>100000±n/a nM
Citation Lafite, PDijols, SBuisson, DMacherey, ACZeldin, DCDansette, PMMansuy, D Design and synthesis of selective, high-affinity inhibitors of human cytochrome P450 2J2. Bioorg Med Chem Lett16:2777-80 (2006) 
 
Cytochrome P450 2C8
Name:Cytochrome P450 2C8
Type:Protein
Mol. Mass.:55839.23
Organism:Homo sapiens (Human)
Description:P10632
Residue:490
BDBM50183079
NameBDBM50183079
Synonyms:4-(4-(hydroxydiphenylmethyl)piperidin-1-yl)-1-(4-propylphenyl)butan-1-one | CHEMBL208528
TypeSmall organic molecule
Emp. Form.C31H37NO2
Mol. Mass.455.631
SMILESCCCc1ccc(cc1)C(=O)CCCN1CCC(CC1)C(O)(c1ccccc1)c1ccccc1